Reaction Details
TargetNuclear factor erythroid 2-related factor 2
LigandBDBM50109402
Substrate/Competitorn/a
Meas. Tech.ChEMBL_1509260 (CHEMBL3602923)
IC50 10170±n/a nM
Citation Jiang, ZYXu, LLLu, MCChen, ZYYuan, ZWXu, XLGuo, XKZhang, XJSun, HPYou, QD Structure-Activity and Structure-Property Relationship and Exploratory in Vivo Evaluation of the Nanomolar Keap1-Nrf2 Protein-Protein Interaction Inhibitor. J Med Chem58:6410-21 (2015) 
 
Nuclear factor erythroid 2-related factor 2
Name:Nuclear factor erythroid 2-related factor 2
Type:PROTEIN
Mol. Mass.:67786.89
Organism:Homo sapiens (Human)
Description:ChEMBL_107924
Residue:605
BDBM50109402
NameBDBM50109402
Synonyms:CHEMBL3601207
TypeSmall organic molecule
Emp. Form.C26H28N2O10S2
Mol. Mass.592.638
SMILESCOc1ccc(cc1)S(=O)(=O)N(CC(O)=O)c1cc(C)c(cc1C)N(CC(O)=O)S(=O)(=O)c1ccc(OC)cc1