Reaction Details
TargetTyrosine-protein kinase JAK3
LigandBDBM50109412
Substrate/Competitorn/a
Meas. Tech.ChEMBL_1509383 (CHEMBL3603326)
IC50 1.4±n/a nM
Citation Tan, LAkahane, KMcNally, RReyskens, KMFicarro, SBLiu, SHerter-Sprie, GSKoyama, SPattison, MJLabella, KJohannessen, LAkbay, EAWong, KKFrank, DAMarto, JALook, TAArthur, JSEck, MJGray, NS Development of Selective Covalent Janus Kinase 3 Inhibitors. J Med Chem58:6589-606 (2015) 
 
Tyrosine-protein kinase JAK3
Name:Tyrosine-protein kinase JAK3
Type:Protein
Mol. Mass.:125111.08
Organism:Homo sapiens (Human)
Description:P52333
Residue:1124
BDBM50109412
NameBDBM50109412
Synonyms:CHEMBL3601232
TypeSmall organic molecule
Emp. Form.C24H24ClFN6O2
Mol. Mass.482.938
SMILESFc1cc(ccc1Nc1ncc(Cl)c(NCc2cccc(NC(=O)C=C)c2)n1)N1CCOCC1