Reaction Details
TargetTyrosine-protein kinase JAK3
LigandBDBM50109415
Substrate/Competitorn/a
Meas. Tech.ChEMBL_1509383 (CHEMBL3603326)
IC50 3.6±n/a nM
Citation Tan, LAkahane, KMcNally, RReyskens, KMFicarro, SBLiu, SHerter-Sprie, GSKoyama, SPattison, MJLabella, KJohannessen, LAkbay, EAWong, KKFrank, DAMarto, JALook, TAArthur, JSEck, MJGray, NS Development of Selective Covalent Janus Kinase 3 Inhibitors. J Med Chem58:6589-606 (2015) 
 
Tyrosine-protein kinase JAK3
Name:Tyrosine-protein kinase JAK3
Type:Protein
Mol. Mass.:125111.08
Organism:Homo sapiens (Human)
Description:P52333
Residue:1124
BDBM50109415
NameBDBM50109415
Synonyms:CHEMBL3601236
TypeSmall organic molecule
Emp. Form.C26H26ClF2N7O2
Mol. Mass.541.98
SMILESCC(=O)N1CCN(CC1)c1c(F)cc(Nc2ncc(Cl)c(NCc3cccc(NC(=O)C=C)c3)n2)cc1F