Reaction Details
TargetTyrosine-protein kinase JAK3
LigandBDBM50109504
Substrate/Competitorn/a
Meas. Tech.ChEMBL_1509383 (CHEMBL3603326)
IC50 1.3±n/a nM
Citation Tan, LAkahane, KMcNally, RReyskens, KMFicarro, SBLiu, SHerter-Sprie, GSKoyama, SPattison, MJLabella, KJohannessen, LAkbay, EAWong, KKFrank, DAMarto, JALook, TAArthur, JSEck, MJGray, NS Development of Selective Covalent Janus Kinase 3 Inhibitors. J Med Chem58:6589-606 (2015) 
 
Tyrosine-protein kinase JAK3
Name:Tyrosine-protein kinase JAK3
Type:Protein
Mol. Mass.:125111.08
Organism:Homo sapiens (Human)
Description:P52333
Residue:1124
BDBM50109504
NameBDBM50109504
Synonyms:CHEMBL3601708
TypeSmall organic molecule
Emp. Form.C20H22ClN7O2
Mol. Mass.427.887
SMILESCOCCn1cc(Nc2ncc(Cl)c(NCc3ccc(NC(=O)C=C)cc3)n2)cn1