Reaction Details
TargetTyrosine-protein kinase JAK3
LigandBDBM50109508
Substrate/Competitorn/a
Meas. Tech.ChEMBL_1509383 (CHEMBL3603326)
IC50 1.2±n/a nM
Citation Tan, LAkahane, KMcNally, RReyskens, KMFicarro, SBLiu, SHerter-Sprie, GSKoyama, SPattison, MJLabella, KJohannessen, LAkbay, EAWong, KKFrank, DAMarto, JALook, TAArthur, JSEck, MJGray, NS Development of Selective Covalent Janus Kinase 3 Inhibitors. J Med Chem58:6589-606 (2015) 
 
Tyrosine-protein kinase JAK3
Name:Tyrosine-protein kinase JAK3
Type:Protein
Mol. Mass.:125111.08
Organism:Homo sapiens (Human)
Description:P52333
Residue:1124
BDBM50109508
NameBDBM50109508
Synonyms:CHEMBL3601712
TypeSmall organic molecule
Emp. Form.C18H17ClN6OS
Mol. Mass.400.885
SMILESCn1cc(Nc2ncc(Cl)c(SCc3cccc(NC(=O)C=C)c3)n2)cn1