Reaction Details
TargetEpidermal growth factor receptor
LigandBDBM50109532
Substrate/Competitorn/a
Meas. Tech.ChEMBL_1509378 (CHEMBL3603321)
IC50 409±n/a nM
Citation Tan, LAkahane, KMcNally, RReyskens, KMFicarro, SBLiu, SHerter-Sprie, GSKoyama, SPattison, MJLabella, KJohannessen, LAkbay, EAWong, KKFrank, DAMarto, JALook, TAArthur, JSEck, MJGray, NS Development of Selective Covalent Janus Kinase 3 Inhibitors. J Med Chem58:6589-606 (2015) 
 
Epidermal growth factor receptor
Name:Epidermal growth factor receptor
Type:Receptor Kinase Domain
Mol. Mass.:134279.59
Organism:Homo sapiens (Human)
Description:P00533
Residue:1210
BDBM50109532
NameBDBM50109532
Synonyms:CHEMBL3601223
TypeSmall organic molecule
Emp. Form.C26H30ClN7O2
Mol. Mass.508.015
SMILESCOc1cc(ccc1Nc1ncc(Cl)c(NCc2cccc(NC(=O)C=C)c2)n1)N1CCN(C)CC1