Reaction Details
TargetTyrosine-protein kinase JAK1
LigandBDBM50109530
Substrate/Competitorn/a
Meas. Tech.ChEMBL_1509375 (CHEMBL3603318)
IC50 495±n/a nM
Citation Tan, LAkahane, KMcNally, RReyskens, KMFicarro, SBLiu, SHerter-Sprie, GSKoyama, SPattison, MJLabella, KJohannessen, LAkbay, EAWong, KKFrank, DAMarto, JALook, TAArthur, JSEck, MJGray, NS Development of Selective Covalent Janus Kinase 3 Inhibitors. J Med Chem58:6589-606 (2015) 
 
Tyrosine-protein kinase JAK1
Name:Tyrosine-protein kinase JAK1
Type:Protein
Mol. Mass.:133293.73
Organism:Homo sapiens (Human)
Description:P23458
Residue:1154
BDBM50109530
NameBDBM50109530
Synonyms:CHEMBL3601235
TypeSmall organic molecule
Emp. Form.C24H23ClF2N6O2
Mol. Mass.500.928
SMILESFc1cc(Nc2ncc(Cl)c(NCc3cccc(NC(=O)C=C)c3)n2)cc(F)c1N1CCOCC1