Reaction Details
TargetDual specificity protein kinase TTK
LigandBDBM50109529
Substrate/Competitorn/a
Meas. Tech.ChEMBL_1509368 (CHEMBL3603311)
IC50 180±n/a nM
Citation Tan, LAkahane, KMcNally, RReyskens, KMFicarro, SBLiu, SHerter-Sprie, GSKoyama, SPattison, MJLabella, KJohannessen, LAkbay, EAWong, KKFrank, DAMarto, JALook, TAArthur, JSEck, MJGray, NS Development of Selective Covalent Janus Kinase 3 Inhibitors. J Med Chem58:6589-606 (2015) 
 
Dual specificity protein kinase TTK
Name:Dual specificity protein kinase TTK
Type:Protein
Mol. Mass.:97086.79
Organism:Homo sapiens (Human)
Description:P33981
Residue:857
BDBM50109529
NameBDBM50109529
Synonyms:CHEMBL3601242
TypeSmall organic molecule
Emp. Form.C18H18ClN7O
Mol. Mass.383.835
SMILESCn1cc(Nc2ncc(Cl)c(NCc3cccc(NC(=O)C=C)c3)n2)cn1