Reaction Details
TargetAurora kinase A
LigandBDBM50109528
Substrate/Competitorn/a
Meas. Tech.ChEMBL_1509497 (CHEMBL3602168)
IC50 43±n/a nM
Citation Tan, LAkahane, KMcNally, RReyskens, KMFicarro, SBLiu, SHerter-Sprie, GSKoyama, SPattison, MJLabella, KJohannessen, LAkbay, EAWong, KKFrank, DAMarto, JALook, TAArthur, JSEck, MJGray, NS Development of Selective Covalent Janus Kinase 3 Inhibitors. J Med Chem58:6589-606 (2015) 
 
Aurora kinase A
Name:Aurora kinase A
Type:Serine/threonine-protein kinase
Mol. Mass.:45830.98
Organism:Homo sapiens (Human)
Description:O14965
Residue:403
BDBM50109528
NameBDBM50109528
Synonyms:CHEMBL3601115
TypeSmall organic molecule
Emp. Form.C20H22ClN7O2
Mol. Mass.427.887
SMILESCOCCn1cc(Nc2ncc(Cl)c(NCc3cccc(NC(=O)C=C)c3)n2)cn1