Reaction Details
TargetPolyunsaturated fatty acid lipoxygenase ALOX15
LigandBDBM50109729
Substrate/Competitorn/a
Meas. Tech.ChEMBL_1509997 (CHEMBL3608050)
IC50 2.0±n/a nM
Citation Pelcman, BSanin, ANilsson, PNo, KSchaal, WÖhrman, SKrog-Jensen, CForsell, PHallberg, ALarhed, MBoesen, TKromann, HVogensen, SBGroth, TClaesson, HE 3-Substituted pyrazoles and 4-substituted triazoles as inhibitors of human 15-lipoxygenase-1. Bioorg Med Chem Lett25:3024-9 (2015) 
 
Polyunsaturated fatty acid lipoxygenase ALOX15
Name:Polyunsaturated fatty acid lipoxygenase ALOX15
Type:Protein
Mol. Mass.:74804.05
Organism:Homo sapiens (Human)
Description:n/a
Residue:662
BDBM50109729
NameBDBM50109729
Synonyms:CHEMBL3604185
TypeSmall organic molecule
Emp. Form.C10H4Cl3N3O
Mol. Mass.288.517
SMILESClc1[nH]nc(c1Cl)-c1nc2ccc(Cl)cc2o1