Reaction Details
TargetProstaglandin E synthase
LigandBDBM31132
Substrate/Competitorn/a
Meas. Tech.ChEMBL_1510157 (CHEMBL3606528)
IC50 9200±n/a nM
Citation Noha, SMFischer, KKoeberle, AGarscha, UWerz, OSchuster, D Discovery of novel, non-acidic mPGES-1 inhibitors by virtual screening with a multistep protocol. Bioorg Med Chem23:4839-45 (2015) 
 
Prostaglandin E synthase
Name:Prostaglandin E synthase
Type:Protein
Mol. Mass.:17112.22
Organism:Homo sapiens (Human)
Description:n/a
Residue:152
BDBM31132
NameBDBM31132
Synonyms:5-hydroxy-1H-benzo[g]indole-3-carboxylate, 11k
TypeSmall organic molecule
Emp. Form.C21H16ClNO3
Mol. Mass.365.81
SMILESCCOC(=O)c1c([nH]c2c1cc(O)c1ccccc21)-c1cccc(Cl)c1