Reaction Details
TargetProstaglandin E synthase
LigandBDBM50109824
Substrate/Competitorn/a
Meas. Tech.ChEMBL_1510157 (CHEMBL3606528)
IC50 1400±n/a nM
Citation Noha, SMFischer, KKoeberle, AGarscha, UWerz, OSchuster, D Discovery of novel, non-acidic mPGES-1 inhibitors by virtual screening with a multistep protocol. Bioorg Med Chem23:4839-45 (2015) 
 
Prostaglandin E synthase
Name:Prostaglandin E synthase
Type:Protein
Mol. Mass.:17112.22
Organism:Homo sapiens (Human)
Description:n/a
Residue:152
BDBM50109824
NameBDBM50109824
Synonyms:CHEMBL1290049
TypeSmall organic molecule
Emp. Form.C21H14ClFN2O2S
Mol. Mass.412.864
SMILESFc1cccc(Cl)c1-c1nc(c[nH]1)-c1ccc(cc1)S(=O)(=O)c1ccccc1