Reaction Details
TargetProstaglandin E synthase
LigandBDBM50109826
Substrate/Competitorn/a
Meas. Tech.ChEMBL_1510157 (CHEMBL3606528)
IC50 940±n/a nM
Citation Noha, SMFischer, KKoeberle, AGarscha, UWerz, OSchuster, D Discovery of novel, non-acidic mPGES-1 inhibitors by virtual screening with a multistep protocol. Bioorg Med Chem23:4839-45 (2015) 
 
Prostaglandin E synthase
Name:Prostaglandin E synthase
Type:Protein
Mol. Mass.:17112.22
Organism:Homo sapiens (Human)
Description:n/a
Residue:152
BDBM50109826
NameBDBM50109826
Synonyms:CHEMBL1289286
TypeSmall organic molecule
Emp. Form.C19H10ClFN4S
Mol. Mass.380.826
SMILESFc1cccc(Cl)c1-c1nc(c[nH]1)-c1ccc(nc1)C#Cc1nccs1