Reaction Details
TargetProstaglandin E synthase
LigandBDBM50360814
Substrate/Competitorn/a
Meas. Tech.ChEMBL_1510157 (CHEMBL3606528)
IC50 900±n/a nM
Citation Noha, SMFischer, KKoeberle, AGarscha, UWerz, OSchuster, D Discovery of novel, non-acidic mPGES-1 inhibitors by virtual screening with a multistep protocol. Bioorg Med Chem23:4839-45 (2015) 
 
Prostaglandin E synthase
Name:Prostaglandin E synthase
Type:Protein
Mol. Mass.:17112.22
Organism:Homo sapiens (Human)
Description:n/a
Residue:152
BDBM50360814
NameBDBM50360814
Synonyms:CHEMBL1934792
TypeSmall organic molecule
Emp. Form.C16H9BrClN3
Mol. Mass.358.62
SMILESClc1cccc(c1)-c1nc2c(cnc3cc(Br)ccc23)[nH]1