Reaction Details
TargetProstaglandin E synthase
LigandBDBM31122
Substrate/Competitorn/a
Meas. Tech.ChEMBL_1510157 (CHEMBL3606528)
IC50 600±n/a nM
Citation Noha, SMFischer, KKoeberle, AGarscha, UWerz, OSchuster, D Discovery of novel, non-acidic mPGES-1 inhibitors by virtual screening with a multistep protocol. Bioorg Med Chem23:4839-45 (2015) 
 
Prostaglandin E synthase
Name:Prostaglandin E synthase
Type:Protein
Mol. Mass.:17112.22
Organism:Homo sapiens (Human)
Description:n/a
Residue:152
BDBM31122
NameBDBM31122
Synonyms:5-hydroxy-1H-benzo[g]indole-3-carboxylate, 11a
TypeSmall organic molecule
Emp. Form.C22H18ClNO3
Mol. Mass.379.836
SMILESCCOC(=O)c1c(Cc2cccc(Cl)c2)[nH]c2c1cc(O)c1ccccc21