Reaction Details
TargetProstaglandin E synthase
LigandBDBM31127
Substrate/Competitorn/a
Meas. Tech.ChEMBL_1510157 (CHEMBL3606528)
IC50 200±n/a nM
Citation Noha, SMFischer, KKoeberle, AGarscha, UWerz, OSchuster, D Discovery of novel, non-acidic mPGES-1 inhibitors by virtual screening with a multistep protocol. Bioorg Med Chem23:4839-45 (2015) 
 
Prostaglandin E synthase
Name:Prostaglandin E synthase
Type:Protein
Mol. Mass.:17112.22
Organism:Homo sapiens (Human)
Description:n/a
Residue:152
BDBM31127
NameBDBM31127
Synonyms:5-hydroxy-1H-benzo[g]indole-3-carboxylate, 11f
TypeSmall organic molecule
Emp. Form.C22H18BrNO3
Mol. Mass.424.287
SMILESCCOC(=O)c1c(Cc2cccc(Br)c2)[nH]c2c1cc(O)c1ccccc21