Reaction Details
TargetProstaglandin E synthase
LigandBDBM50109830
Substrate/Competitorn/a
Meas. Tech.ChEMBL_1510157 (CHEMBL3606528)
IC50 4.0±n/a nM
Citation Noha, SMFischer, KKoeberle, AGarscha, UWerz, OSchuster, D Discovery of novel, non-acidic mPGES-1 inhibitors by virtual screening with a multistep protocol. Bioorg Med Chem23:4839-45 (2015) 
 
Prostaglandin E synthase
Name:Prostaglandin E synthase
Type:Protein
Mol. Mass.:17112.22
Organism:Homo sapiens (Human)
Description:n/a
Residue:152
BDBM50109830
NameBDBM50109830
Synonyms:CHEMBL1289055
TypeSmall organic molecule
Emp. Form.C22H12Cl2FN3
Mol. Mass.408.255
SMILESFc1cccc(Cl)c1-c1nc(c[nH]1)-c1ccc(nc1)C#Cc1cccc(Cl)c1