Reaction Details
TargetProstaglandin E synthase
LigandBDBM50302421
Substrate/Competitorn/a
Meas. Tech.ChEMBL_1510157 (CHEMBL3606528)
IC50 1.000000±n/a nM
Citation Noha, SMFischer, KKoeberle, AGarscha, UWerz, OSchuster, D Discovery of novel, non-acidic mPGES-1 inhibitors by virtual screening with a multistep protocol. Bioorg Med Chem23:4839-45 (2015) 
 
Prostaglandin E synthase
Name:Prostaglandin E synthase
Type:Protein
Mol. Mass.:17112.22
Organism:Homo sapiens (Human)
Description:n/a
Residue:152
BDBM50302421
NameBDBM50302421
Synonyms:2-(6-(2-cyclopropylethoxy)-9-(2-hydroxy-2-methylpropyl)-1H-phenanthro[9,10-d]imidazol-2-yl)-5-fluoroisophthalonitrile | CHEMBL565406
TypeSmall organic molecule
Emp. Form.C32H27FN4O2
Mol. Mass.518.5808
SMILESCC(C)(O)Cc1ccc2c3nc([nH]c3c3ccc(OCCC4CC4)cc3c2c1)-c1c(cc(F)cc1C#N)C#N