Reaction Details
TargetProstaglandin E synthase
LigandBDBM50109833
Substrate/Competitorn/a
Meas. Tech.ChEMBL_1510157 (CHEMBL3606528)
IC50 400±n/a nM
Citation Noha, SMFischer, KKoeberle, AGarscha, UWerz, OSchuster, D Discovery of novel, non-acidic mPGES-1 inhibitors by virtual screening with a multistep protocol. Bioorg Med Chem23:4839-45 (2015) 
 
Prostaglandin E synthase
Name:Prostaglandin E synthase
Type:Protein
Mol. Mass.:17112.22
Organism:Homo sapiens (Human)
Description:n/a
Residue:152
BDBM50109833
NameBDBM50109833
Synonyms:Arzanol
TypeSmall organic molecule
Emp. Form.C22H26O7
Mol. Mass.402.4376
SMILES[#6]-[#6]-c1oc(=O)c(-[#6]-c2c(-[#8])c(-[#6]\[#6]=[#6](\[#6])-[#6])c(-[#8])c(-[#6](-[#6])=O)c2-[#8])c(-[#8])c1-[#6]