Reaction Details
TargetCholinesterase
LigandBDBM50004000
Substrate/Competitorn/a
Meas. Tech.ChEMBL_1511670 (CHEMBL3607423)
IC50 850±n/a nM
Citation Mehr-un-Nisa, naMunawar, MAChattha, FAKousar, SMunir, JIsmail, TAshraf, MKhan, MA Synthesis of novel triazoles and a tetrazole of escitalopram as cholinesterase inhibitors. Bioorg Med Chem23:6014-24 (2015) 
 
Cholinesterase
Name:Cholinesterase
Type:Homotetramer
Mol. Mass.:68422.27
Organism:Homo sapiens (Human)
Description:P06276
Residue:602
BDBM50004000
NameBDBM50004000
Synonyms:(3aS,8aR)-1,3a,8-trimethyl-1,2,3,3a,8,8a-hexahydropyrrolo[2,3-b]indol-5-yl methylcarbamate CHEMBL94 Physostol | physostigmine
TypeSmall organic molecule
Emp. Form.C15H21N3O2
Mol. Mass.275.3461
SMILESCNC(=O)Oc1ccc2N(C)[C@H]3N(C)CC[C@@]3(C)c2c1