Reaction Details
TargetHistone-lysine N-methyltransferase EZH2
LigandBDBM50017293
Substrate/Competitorn/a
Meas. Tech.ChEMBL_1511672 (CHEMBL3607425)
IC50 1.000000±n/a nM
Citation Gehling, VSVaswani, RGNasveschuk, CGDuplessis, MIyer, PBalasubramanian, SZhao, FGood, ACCampbell, RLee, CDakin, LACook, ASGagnon, AHarmange, JCAudia, JECummings, RTNormant, ETrojer, PAlbrecht, BK Discovery, design, and synthesis of indole-based EZH2 inhibitors. Bioorg Med Chem Lett25:3644-9 (2015) 
 
Histone-lysine N-methyltransferase EZH2
Name:Histone-lysine N-methyltransferase EZH2
Type:Protein
Mol. Mass.:85367.84
Organism:Homo sapiens (Human)
Description:Q15910
Residue:746
BDBM50017293
NameBDBM50017293
Synonyms:CHEMBL3287735 | US10647700, Compound GSK126
TypeSmall organic molecule
Emp. Form.C31H38N6O2
Mol. Mass.526.6724
SMILESCC[C@H](C)n1cc(C)c2c(cc(cc12)-c1ccc(nc1)N1CCNCC1)C(=O)NCc1c(C)cc(C)[nH]c1=O