Reaction Details
TargetHistone-lysine N-methyltransferase EZH2
LigandBDBM50110352
Substrate/Competitorn/a
Meas. Tech.ChEMBL_1511672 (CHEMBL3607425)
IC50 40±n/a nM
Citation Gehling, VSVaswani, RGNasveschuk, CGDuplessis, MIyer, PBalasubramanian, SZhao, FGood, ACCampbell, RLee, CDakin, LACook, ASGagnon, AHarmange, JCAudia, JECummings, RTNormant, ETrojer, PAlbrecht, BK Discovery, design, and synthesis of indole-based EZH2 inhibitors. Bioorg Med Chem Lett25:3644-9 (2015) 
 
Histone-lysine N-methyltransferase EZH2
Name:Histone-lysine N-methyltransferase EZH2
Type:Protein
Mol. Mass.:85367.84
Organism:Homo sapiens (Human)
Description:Q15910
Residue:746
BDBM50110352
NameBDBM50110352
Synonyms:CHEMBL3605459
TypeSmall organic molecule
Emp. Form.C28H35F3N4O5S
Mol. Mass.596.662
SMILESCCS(=O)(=O)N1CCC(CC1)[C@@H](C)n1c(C)c(C(=O)NCc2c(OCC(F)(F)F)cc(C)[nH]c2=O)c2ccccc12