Reaction Details
TargetHistone-lysine N-methyltransferase EZH2
LigandBDBM50110362
Substrate/Competitorn/a
Meas. Tech.ChEMBL_1511672 (CHEMBL3607425)
IC50 14±n/a nM
Citation Gehling, VSVaswani, RGNasveschuk, CGDuplessis, MIyer, PBalasubramanian, SZhao, FGood, ACCampbell, RLee, CDakin, LACook, ASGagnon, AHarmange, JCAudia, JECummings, RTNormant, ETrojer, PAlbrecht, BK Discovery, design, and synthesis of indole-based EZH2 inhibitors. Bioorg Med Chem Lett25:3644-9 (2015) 
 
Histone-lysine N-methyltransferase EZH2
Name:Histone-lysine N-methyltransferase EZH2
Type:Protein
Mol. Mass.:85367.84
Organism:Homo sapiens (Human)
Description:Q15910
Residue:746
BDBM50110362
NameBDBM50110362
Synonyms:CHEMBL3605451
TypeSmall organic molecule
Emp. Form.C22H27N3O2
Mol. Mass.365.4687
SMILESCCC(C)n1c(C)c(C(=O)NCc2c(C)cc(C)nc2O)c2ccccc12