Reaction Details
TargetEctonucleotide pyrophosphatase/phosphodiesterase family member 2
LigandBDBM50110402
Substrate/Competitorn/a
Meas. Tech.ChEMBL_1511787 (CHEMBL3607865)
Ki 1790±n/a nM
Citation Murph, MMJiang, GWAltman, MKJia, WNguyen, DTFambrough, JMHardman, WJNguyen, HTTran, SKAlshamrani, AAMadan, DZhang, JPrestwich, GD Vinyl sulfone analogs of lysophosphatidylcholine irreversibly inhibit autotaxin and prevent angiogenesis in melanoma. Bioorg Med Chem23:5999-6013 (2015) 
 
Ectonucleotide pyrophosphatase/phosphodiesterase family member 2
Name:Ectonucleotide pyrophosphatase/phosphodiesterase family member 2
Type:Enzyme
Mol. Mass.:99007.13
Organism:Homo sapiens (Human)
Description:Q13822
Residue:863
BDBM50110402
NameBDBM50110402
Synonyms:CHEMBL3605581
TypeSmall organic molecule
Emp. Form.C20H42ClNO2S
Mol. Mass.396.071
SMILES[Cl-].CCCCCCCCCCCCC(=C)S(=O)(=O)CCC[N+](C)(C)C