Reaction Details
TargetSomatostatin receptor type 3
LigandBDBM50110462
Substrate/Competitorn/a
Meas. Tech.ChEMBL_1510034 (CHEMBL3606126)
Ki 31±n/a nM
Citation Lai, ZHe, SSherer, ECWu, ZYu, YBall, RHong, QYang, DXGuo, LLi, DTuang, QChicchi, GGTrusca, DTsao, KLZhou, YPHoward, ADNargund, RPHagmann, WK Discovery of substituted (4-phenyl-1H-imidazol-2-yl)methanamine as potent somatostatin receptor 3 agonists. Bioorg Med Chem Lett25:3520-5 (2015) 
 
Somatostatin receptor type 3
Name:Somatostatin receptor type 3
Type:Protein
Mol. Mass.:45855.97
Organism:Homo sapiens (Human)
Description:P32745
Residue:418
BDBM50110462
NameBDBM50110462
Synonyms:CHEMBL3605790
TypeSmall organic molecule
Emp. Form.C29H28N4
Mol. Mass.432.5594
SMILESC(NC1(CCCC1)c1nc(c[nH]1)-c1ccc(cc1)-c1ccccc1)c1c[nH]c2ccccc12