Reaction Details
TargetSomatostatin receptor type 3
LigandBDBM50110465
Substrate/Competitorn/a
Meas. Tech.ChEMBL_1510034 (CHEMBL3606126)
Ki 24±n/a nM
Citation Lai, ZHe, SSherer, ECWu, ZYu, YBall, RHong, QYang, DXGuo, LLi, DTuang, QChicchi, GGTrusca, DTsao, KLZhou, YPHoward, ADNargund, RPHagmann, WK Discovery of substituted (4-phenyl-1H-imidazol-2-yl)methanamine as potent somatostatin receptor 3 agonists. Bioorg Med Chem Lett25:3520-5 (2015) 
 
Somatostatin receptor type 3
Name:Somatostatin receptor type 3
Type:Protein
Mol. Mass.:45855.97
Organism:Homo sapiens (Human)
Description:P32745
Residue:418
BDBM50110465
NameBDBM50110465
Synonyms:CHEMBL3605793
TypeSmall organic molecule
Emp. Form.C23H25N5
Mol. Mass.371.4781
SMILESCc1ccc(cc1)-c1c[nH]c(n1)C1(CCCC1)NCc1c[nH]c2cccnc12