Reaction Details
Target2-acylglycerol O-acyltransferase 2
LigandBDBM50110588
Substrate/Competitorn/a
Meas. Tech.ChEMBL_1510039 (CHEMBL3606131)
IC50 3060±n/a nM
Citation Busujima, TTanaka, HShirasaki, YMunetomo, ESaito, MKitano, KMinagawa, TYoshida, KOsaki, NSato, N Identification of 2-[2-(4-tert-butylphenyl)ethyl]-N-(4-fluorophenyl)-1,2,3,4-tetrahydroisoquinoline-6-sulfonamide (29) as an orally available MGAT2 inhibitor. Bioorg Med Chem23:5922-31 (2015) 
 
2-acylglycerol O-acyltransferase 2
Name:2-acylglycerol O-acyltransferase 2
Type:Enzyme
Mol. Mass.:38210.80
Organism:Homo sapiens (Human)
Description:Q3SYC2
Residue:334
BDBM50110588
NameBDBM50110588
Synonyms:CHEMBL3605834
TypeSmall organic molecule
Emp. Form.C27H31FN2O2S
Mol. Mass.466.611
SMILESCC(C)(C)c1ccc(CCN2CCc3ccc(cc3C2)S(=O)(=O)Nc2ccc(F)cc2)cc1