Reaction Details
Target2-acylglycerol O-acyltransferase 2
LigandBDBM50110678
Substrate/Competitorn/a
Meas. Tech.ChEMBL_1510039 (CHEMBL3606131)
IC50 547±n/a nM
Citation Busujima, TTanaka, HShirasaki, YMunetomo, ESaito, MKitano, KMinagawa, TYoshida, KOsaki, NSato, N Identification of 2-[2-(4-tert-butylphenyl)ethyl]-N-(4-fluorophenyl)-1,2,3,4-tetrahydroisoquinoline-6-sulfonamide (29) as an orally available MGAT2 inhibitor. Bioorg Med Chem23:5922-31 (2015) 
 
2-acylglycerol O-acyltransferase 2
Name:2-acylglycerol O-acyltransferase 2
Type:Enzyme
Mol. Mass.:38210.80
Organism:Homo sapiens (Human)
Description:Q3SYC2
Residue:334
BDBM50110678
NameBDBM50110678
Synonyms:CHEMBL3605830
TypeSmall organic molecule
Emp. Form.C29H34FN3O4S
Mol. Mass.539.661
SMILESCCCCOc1ccc(NS(=O)(=O)c2ccc3CN(Cc3c2)C(=O)Nc2ccc(cc2)C(C)(C)C)c(F)c1