Reaction Details
Target2-acylglycerol O-acyltransferase 2
LigandBDBM50110680
Substrate/Competitorn/a
Meas. Tech.ChEMBL_1510039 (CHEMBL3606131)
IC50 5200±n/a nM
Citation Busujima, TTanaka, HShirasaki, YMunetomo, ESaito, MKitano, KMinagawa, TYoshida, KOsaki, NSato, N Identification of 2-[2-(4-tert-butylphenyl)ethyl]-N-(4-fluorophenyl)-1,2,3,4-tetrahydroisoquinoline-6-sulfonamide (29) as an orally available MGAT2 inhibitor. Bioorg Med Chem23:5922-31 (2015) 
 
2-acylglycerol O-acyltransferase 2
Name:2-acylglycerol O-acyltransferase 2
Type:Enzyme
Mol. Mass.:38210.80
Organism:Homo sapiens (Human)
Description:Q3SYC2
Residue:334
BDBM50110680
NameBDBM50110680
Synonyms:CHEMBL3605828
TypeSmall organic molecule
Emp. Form.C27H30FN3O4S
Mol. Mass.511.608
SMILESCCOc1ccc(NS(=O)(=O)c2ccc3CN(Cc3c2)C(=O)Nc2ccc(cc2)C(C)(C)C)c(F)c1