Reaction Details
Target2-acylglycerol O-acyltransferase 2
LigandBDBM50110691
Substrate/Competitorn/a
Meas. Tech.ChEMBL_1510039 (CHEMBL3606131)
IC50 1110±n/a nM
Citation Busujima, TTanaka, HShirasaki, YMunetomo, ESaito, MKitano, KMinagawa, TYoshida, KOsaki, NSato, N Identification of 2-[2-(4-tert-butylphenyl)ethyl]-N-(4-fluorophenyl)-1,2,3,4-tetrahydroisoquinoline-6-sulfonamide (29) as an orally available MGAT2 inhibitor. Bioorg Med Chem23:5922-31 (2015) 
 
2-acylglycerol O-acyltransferase 2
Name:2-acylglycerol O-acyltransferase 2
Type:Enzyme
Mol. Mass.:38210.80
Organism:Homo sapiens (Human)
Description:Q3SYC2
Residue:334
BDBM50110691
NameBDBM50110691
Synonyms:CHEMBL3605821
TypeSmall organic molecule
Emp. Form.C25H25ClFN3O3S
Mol. Mass.502.001
SMILESCC(C)(C)c1ccc(NC(=O)N2Cc3ccc(cc3C2)S(=O)(=O)Nc2ccc(F)cc2Cl)cc1