Reaction Details
TargetGlucocorticoid receptor
LigandBDBM50110733
Substrate/Competitorn/a
Meas. Tech.ChEMBL_1510388 (CHEMBL3607228)
IC50 22±n/a nM
Citation Luz, JGCarson, MWCondon, BClawson, DPustilnik, AKohlman, DTBarr, RJBean, JSDill, MJSindelar, DKMaletic, MCoghlan, MJ Indole Glucocorticoid Receptor Antagonists Active in a Model of Dyslipidemia Act via a Unique Association with an Agonist Binding Site. J Med Chem58:6607-18 (2015) 
 
Glucocorticoid receptor
Name:Glucocorticoid receptor
Type:Enzyme
Mol. Mass.:85656.87
Organism:Homo sapiens (Human)
Description:P04150
Residue:777
BDBM50110733
NameBDBM50110733
Synonyms:CHEMBL3605929
TypeSmall organic molecule
Emp. Form.C17H16F2N2O3S
Mol. Mass.366.382
SMILESCOc1cc(F)ccc1-c1c(C)[nH]c2c(NS(C)(=O)=O)cc(F)cc12