Reaction Details
TargetGlucocorticoid receptor
LigandBDBM50110735
Substrate/Competitorn/a
Meas. Tech.ChEMBL_1510389 (CHEMBL3607229)
IC50 76±n/a nM
Citation Luz, JGCarson, MWCondon, BClawson, DPustilnik, AKohlman, DTBarr, RJBean, JSDill, MJSindelar, DKMaletic, MCoghlan, MJ Indole Glucocorticoid Receptor Antagonists Active in a Model of Dyslipidemia Act via a Unique Association with an Agonist Binding Site. J Med Chem58:6607-18 (2015) 
 
Glucocorticoid receptor
Name:Glucocorticoid receptor
Type:Enzyme Catalytic Domain
Mol. Mass.:87556.83
Organism:RAT
Description:Glucocorticoid 0 RAT::P06536
Residue:795
BDBM50110735
NameBDBM50110735
Synonyms:CHEMBL3605932
TypeSmall organic molecule
Emp. Form.C15H13ClN2O2S
Mol. Mass.320.794
SMILESCS(=O)(=O)Nc1cccc2c(c[nH]c12)-c1cccc(Cl)c1