Reaction Details
TargetAndrogen receptor
LigandBDBM18627
Substrate/Competitorn/a
Meas. Tech.ChEMBL_1510385 (CHEMBL3607225)
Ki 6.0±n/a nM
Citation Luz, JGCarson, MWCondon, BClawson, DPustilnik, AKohlman, DTBarr, RJBean, JSDill, MJSindelar, DKMaletic, MCoghlan, MJ Indole Glucocorticoid Receptor Antagonists Active in a Model of Dyslipidemia Act via a Unique Association with an Agonist Binding Site. J Med Chem58:6607-18 (2015) 
 
Androgen receptor
Name:Androgen receptor
Type:Receptor
Mol. Mass.:99185.27
Organism:Homo sapiens (Human)
Description:CHO cells were stably transfected with human AR gene.
Residue:920
BDBM18627
NameBDBM18627
Synonyms:(10S,11S,14S,15S,17R)-17-[4-(dimethylamino)phenyl]-14-hydroxy-15-methyl-14-(prop-1-yn-1-yl)tetracyclo[8.7.0.0^{2,7}.0^{11,15}]heptadeca-1,6-dien-5-one Mifepristone RU486 (tetramethyl-rhodamine conjugated)
TypeSmall organic molecule
Emp. Form.C29H35NO2
Mol. Mass.429.5937
SMILES[H][C@@]12CC[C@@](O)(C#CC)[C@@]1(C)C[C@@H](C1=C3CCC(=O)C=C3CC[C@@]21[H])c1ccc(cc1)N(C)C