Reaction Details
TargetProgesterone receptor
LigandBDBM50110730
Substrate/Competitorn/a
Meas. Tech.ChEMBL_1510386 (CHEMBL3607226)
Ki 64±n/a nM
Citation Luz, JGCarson, MWCondon, BClawson, DPustilnik, AKohlman, DTBarr, RJBean, JSDill, MJSindelar, DKMaletic, MCoghlan, MJ Indole Glucocorticoid Receptor Antagonists Active in a Model of Dyslipidemia Act via a Unique Association with an Agonist Binding Site. J Med Chem58:6607-18 (2015) 
 
Progesterone receptor
Name:Progesterone receptor
Type:Protein
Mol. Mass.:98979.52
Organism:Homo sapiens (Human)
Description:P06401
Residue:933
BDBM50110730
NameBDBM50110730
Synonyms:CHEMBL3605919
TypeSmall organic molecule
Emp. Form.C28H32FN3O3S
Mol. Mass.509.635
SMILESCOc1cc(F)ccc1-c1c(CN(C)Cc2ccccc2)[nH]c2c(NS(C)(=O)=O)cc(cc12)C(C)C