Reaction Details
TargetProgesterone receptor
LigandBDBM50110751
Substrate/Competitorn/a
Meas. Tech.ChEMBL_1510386 (CHEMBL3607226)
Ki 44±n/a nM
Citation Luz, JGCarson, MWCondon, BClawson, DPustilnik, AKohlman, DTBarr, RJBean, JSDill, MJSindelar, DKMaletic, MCoghlan, MJ Indole Glucocorticoid Receptor Antagonists Active in a Model of Dyslipidemia Act via a Unique Association with an Agonist Binding Site. J Med Chem58:6607-18 (2015) 
 
Progesterone receptor
Name:Progesterone receptor
Type:Protein
Mol. Mass.:98979.52
Organism:Homo sapiens (Human)
Description:P06401
Residue:933
BDBM50110751
NameBDBM50110751
Synonyms:CHEMBL3605928
TypeSmall organic molecule
Emp. Form.C22H19FN2O3S
Mol. Mass.410.461
SMILESCOc1ccc(F)cc1-c1c([nH]c2c(NS(C)(=O)=O)cccc12)-c1ccccc1