Reaction Details
TargetGlucocorticoid receptor
LigandBDBM50110734
Substrate/Competitorn/a
Meas. Tech.ChEMBL_1510382 (CHEMBL3607222)
Ki 5.5±n/a nM
Citation Luz, JGCarson, MWCondon, BClawson, DPustilnik, AKohlman, DTBarr, RJBean, JSDill, MJSindelar, DKMaletic, MCoghlan, MJ Indole Glucocorticoid Receptor Antagonists Active in a Model of Dyslipidemia Act via a Unique Association with an Agonist Binding Site. J Med Chem58:6607-18 (2015) 
 
Glucocorticoid receptor
Name:Glucocorticoid receptor
Type:Enzyme
Mol. Mass.:85656.87
Organism:Homo sapiens (Human)
Description:P04150
Residue:777
BDBM50110734
NameBDBM50110734
Synonyms:CHEMBL3605930
TypeSmall organic molecule
Emp. Form.C16H15ClN2O3S
Mol. Mass.350.82
SMILESCOc1ccc(Cl)cc1-c1c[nH]c2c(NS(C)(=O)=O)cccc12