Reaction Details
TargetEukaryotic translation initiation factor 4E
LigandBDBM50110845
Substrate/Competitorn/a
Meas. Tech.ChEMBL_1511842 (CHEMBL3608168)
IC50 25000±n/a nM
Citation Ziemniak, MKowalska, JLukaszewicz, MZuberek, JWnek, KDarzynkiewicz, EJemielity, J Phosphate-modified analogues of m(7)GTP and m(7)Gppppm(7)G-Synthesis and biochemical properties. Bioorg Med Chem23:5369-81 (2015) 
 
Eukaryotic translation initiation factor 4E
Name:Eukaryotic translation initiation factor 4E
Type:PROTEIN
Mol. Mass.:25047.40
Organism:Oryctolagus cuniculus
Description:ChEMBL_1511842
Residue:217
BDBM50110845
NameBDBM50110845
Synonyms:CHEMBL3351000
TypeSmall organic molecule
Emp. Form.C21H29N10O18P3
Mol. Mass.802.4324
SMILESC[n+]1cn([C@@H]2O[C@H](COP(O)(=O)OP([O-])(=O)OP(O)(=O)OC[C@H]3O[C@H]([C@H](O)[C@@H]3O)n3cnc4c3nc(N)[nH]c4=O)[C@@H](O)[C@H]2O)c2nc(N)[nH]c(=O)c12