Reaction Details
TargetADP-ribosyl cyclase/cyclic ADP-ribose hydrolase 1
LigandBDBM50110922
Substrate/Competitorn/a
Meas. Tech.ChEMBL_1509931 (CHEMBL3607749)
IC50 990±n/a nM
Citation Becherer, JDBoros, EECarpenter, TYCowan, DJDeaton, DNHaffner, CDJeune, MRKaldor, IWPoole, JCPreugschat, FRheault, TRSchulte, CAShearer, BGShearer, TWShewchuk, LMSmalley, TLStewart, ELStuart, JDUlrich, JC Discovery of 4-Amino-8-quinoline Carboxamides as Novel, Submicromolar Inhibitors of NAD-Hydrolyzing Enzyme CD38. J Med Chem58:7021-56 (2015) 
 
ADP-ribosyl cyclase/cyclic ADP-ribose hydrolase 1
Name:ADP-ribosyl cyclase/cyclic ADP-ribose hydrolase 1
Type:PROTEIN
Mol. Mass.:34333.62
Organism:Homo sapiens (Human)
Description:ChEMBL_1509931
Residue:300
BDBM50110922
NameBDBM50110922
Synonyms:CHEMBL3604722
TypeSmall organic molecule
Emp. Form.C18H15Cl2N3O
Mol. Mass.360.237
SMILESCc1cc(NCc2c(Cl)cccc2Cl)c2cccc(C(N)=O)c2n1