Reaction Details
TargetADP-ribosyl cyclase/cyclic ADP-ribose hydrolase 1
LigandBDBM50111135
Substrate/Competitorn/a
Meas. Tech.ChEMBL_1509931 (CHEMBL3607749)
IC50 76±n/a nM
Citation Becherer, JDBoros, EECarpenter, TYCowan, DJDeaton, DNHaffner, CDJeune, MRKaldor, IWPoole, JCPreugschat, FRheault, TRSchulte, CAShearer, BGShearer, TWShewchuk, LMSmalley, TLStewart, ELStuart, JDUlrich, JC Discovery of 4-Amino-8-quinoline Carboxamides as Novel, Submicromolar Inhibitors of NAD-Hydrolyzing Enzyme CD38. J Med Chem58:7021-56 (2015) 
 
ADP-ribosyl cyclase/cyclic ADP-ribose hydrolase 1
Name:ADP-ribosyl cyclase/cyclic ADP-ribose hydrolase 1
Type:PROTEIN
Mol. Mass.:34333.62
Organism:Homo sapiens (Human)
Description:ChEMBL_1509931
Residue:300
BDBM50111135
NameBDBM50111135
Synonyms:CHEMBL3604758
TypeSmall organic molecule
Emp. Form.C18H13Cl3FN3O
Mol. Mass.412.673
SMILESCc1cc(NCc2c(Cl)ccc(Cl)c2Cl)c2cc(F)cc(C(N)=O)c2n1