Reaction Details
TargetADP-ribosyl cyclase/cyclic ADP-ribose hydrolase 1
LigandBDBM50111203
Substrate/Competitorn/a
Meas. Tech.ChEMBL_1509932 (CHEMBL3607750)
IC50 46±n/a nM
Citation Becherer, JDBoros, EECarpenter, TYCowan, DJDeaton, DNHaffner, CDJeune, MRKaldor, IWPoole, JCPreugschat, FRheault, TRSchulte, CAShearer, BGShearer, TWShewchuk, LMSmalley, TLStewart, ELStuart, JDUlrich, JC Discovery of 4-Amino-8-quinoline Carboxamides as Novel, Submicromolar Inhibitors of NAD-Hydrolyzing Enzyme CD38. J Med Chem58:7021-56 (2015) 
 
ADP-ribosyl cyclase/cyclic ADP-ribose hydrolase 1
Name:ADP-ribosyl cyclase/cyclic ADP-ribose hydrolase 1
Type:PROTEIN
Mol. Mass.:34417.04
Organism:Mus musculus
Description:ChEMBL_109609
Residue:304
BDBM50111203
NameBDBM50111203
Synonyms:CHEMBL3604735
TypeSmall organic molecule
Emp. Form.C18H14Cl3N3O
Mol. Mass.394.682
SMILESCc1cc(NCc2c(Cl)ccc(Cl)c2Cl)c2cccc(C(N)=O)c2n1