Reaction Details
TargetRibosomal protein S6 kinase alpha-3
LigandBDBM50111363
Substrate/Competitorn/a
Meas. Tech.ChEMBL_1509948 (CHEMBL3607766)
EC50>20000±n/a nM
Citation Jain, RMathur, MLan, JCostales, AAtallah, GRamurthy, SSubramanian, SSetti, LFeucht, PWarne, BDoyle, LBasham, SJefferson, ABLindvall, MAppleton, BAShafer, CM Discovery of Potent and Selective RSK Inhibitors as Biological Probes. J Med Chem58:6766-83 (2015) 
 
Ribosomal protein S6 kinase alpha-3
Name:Ribosomal protein S6 kinase alpha-3
Type:PROTEIN
Mol. Mass.:83697.95
Organism:Mus musculus
Description:ChEMBL_108393
Residue:740
BDBM50111363
NameBDBM50111363
Synonyms:CHEMBL3604780
TypeSmall organic molecule
Emp. Form.C16H16F2N2O
Mol. Mass.290.3078
SMILESOc1c(F)cc(cc1F)-c1cnccc1C1CCNCC1