Reaction Details
TargetRibosomal protein S6 kinase alpha-3
LigandBDBM50111389
Substrate/Competitorn/a
Meas. Tech.ChEMBL_1509948 (CHEMBL3607766)
EC50 1600±n/a nM
Citation Jain, RMathur, MLan, JCostales, AAtallah, GRamurthy, SSubramanian, SSetti, LFeucht, PWarne, BDoyle, LBasham, SJefferson, ABLindvall, MAppleton, BAShafer, CM Discovery of Potent and Selective RSK Inhibitors as Biological Probes. J Med Chem58:6766-83 (2015) 
 
Ribosomal protein S6 kinase alpha-3
Name:Ribosomal protein S6 kinase alpha-3
Type:PROTEIN
Mol. Mass.:83697.95
Organism:Mus musculus
Description:ChEMBL_108393
Residue:740
BDBM50111389
NameBDBM50111389
Synonyms:CHEMBL3604789
TypeSmall organic molecule
Emp. Form.C18H13F2NO
Mol. Mass.297.2987
SMILESCc1ccc(cc1)-c1ccncc1-c1cc(F)c(O)c(F)c1