Reaction Details
TargetRibosomal protein S6 kinase alpha-3
LigandBDBM50111375
Substrate/Competitorn/a
Meas. Tech.ChEMBL_1509948 (CHEMBL3607766)
EC50 1500±n/a nM
Citation Jain, RMathur, MLan, JCostales, AAtallah, GRamurthy, SSubramanian, SSetti, LFeucht, PWarne, BDoyle, LBasham, SJefferson, ABLindvall, MAppleton, BAShafer, CM Discovery of Potent and Selective RSK Inhibitors as Biological Probes. J Med Chem58:6766-83 (2015) 
 
Ribosomal protein S6 kinase alpha-3
Name:Ribosomal protein S6 kinase alpha-3
Type:PROTEIN
Mol. Mass.:83697.95
Organism:Mus musculus
Description:ChEMBL_108393
Residue:740
BDBM50111375
NameBDBM50111375
Synonyms:CHEMBL3604887
TypeSmall organic molecule
Emp. Form.C20H19F2N3O
Mol. Mass.355.3812
SMILESCC(C)Nc1ncc(-c2cc(F)c(O)c(F)c2)c(n1)-c1ccc(C)cc1