Reaction Details
TargetEpidermal growth factor receptor
LigandBDBM50111480
Substrate/Competitorn/a
Meas. Tech.ChEMBL_1510113 (CHEMBL3606403)
IC50 2.0±n/a nM
Citation Engel, JRichters, AGetlik, MTomassi, SKeul, MTermathe, MLategahn, JBecker, CMayer-Wrangowski, SGrütter, CUhlenbrock, NKrüll, JSchaumann, NEppmann, SKibies, PHoffgaard, FHeil, JMenninger, SOrtiz-Cuaran, SHeuckmann, JMTinnefeld, VZahedi, RPSos, MLSchultz-Fademrecht, CThomas, RKKast, SMRauh, D Targeting Drug Resistance in EGFR with Covalent Inhibitors: A Structure-Based Design Approach. J Med Chem58:6844-63 (2015) 
 
Epidermal growth factor receptor
Name:Epidermal growth factor receptor
Type:Receptor Kinase Domain
Mol. Mass.:134279.59
Organism:Homo sapiens (Human)
Description:P00533
Residue:1210
BDBM50111480
NameBDBM50111480
Synonyms:CHEMBL3604943
TypeSmall organic molecule
Emp. Form.C28H31N7O2
Mol. Mass.497.5914
SMILESCOc1cc(N2CCN(C)CC2)c(NC(=O)C=C)cc1Nc1nccc(n1)-c1cn(C)c2ccccc12