Reaction Details
TargetHypoxanthine-guanine phosphoribosyltransferase
LigandBDBM50111505
Substrate/Competitorn/a
Meas. Tech.ChEMBL_1510258 (CHEMBL3606787)
Ki 600±n/a nM
Citation Hocková, DJaneba, ZNaesens, LEdstein, MDChavchich, MKeough, DTGuddat, LW Antimalarial activity of prodrugs of N-branched acyclic nucleoside phosphonate inhibitors of 6-oxopurine phosphoribosyltransferases. Bioorg Med Chem23:5502-10 (2015) 
 
Hypoxanthine-guanine phosphoribosyltransferase
Name:Hypoxanthine-guanine phosphoribosyltransferase
Type:Protein
Mol. Mass.:24579.61
Organism:Homo sapiens (Human)
Description:P00492
Residue:218
BDBM50111505
NameBDBM50111505
Synonyms:CHEMBL3604955
TypeSmall organic molecule
Emp. Form.C12H21N6O6P
Mol. Mass.376.3055
SMILESNc1nc2n(CCN(CCP(O)(O)=O)CC(O)CO)cnc2c(=O)[nH]1