Reaction Details
TargetHypoxanthine-guanine phosphoribosyltransferase
LigandBDBM50111509
Substrate/Competitorn/a
Meas. Tech.ChEMBL_1510258 (CHEMBL3606787)
Ki 13000±n/a nM
Citation Hocková, DJaneba, ZNaesens, LEdstein, MDChavchich, MKeough, DTGuddat, LW Antimalarial activity of prodrugs of N-branched acyclic nucleoside phosphonate inhibitors of 6-oxopurine phosphoribosyltransferases. Bioorg Med Chem23:5502-10 (2015) 
 
Hypoxanthine-guanine phosphoribosyltransferase
Name:Hypoxanthine-guanine phosphoribosyltransferase
Type:Protein
Mol. Mass.:24579.61
Organism:Homo sapiens (Human)
Description:P00492
Residue:218
BDBM50111509
NameBDBM50111509
Synonyms:CHEMBL3604959
TypeSmall organic molecule
Emp. Form.C18H24N5O5P
Mol. Mass.421.3874
SMILESOP(O)(=O)CCN(CCOCc1ccccc1)CCn1cnc2c1nc[nH]c2=O