Reaction Details
TargetCannabinoid receptor 2
LigandBDBM50111557
Substrate/Competitorn/a
Meas. Tech.ChEMBL_1510266 (CHEMBL3606862)
Ki 2618±n/a nM
Citation Presley, CSMustafa, SMAbidi, AHMoore, BM Synthesis and biological evaluation of (3',5'-dichloro-2,6-dihydroxy-biphenyl-4-yl)-aryl/alkyl-methanone selective CB2 inverse agonist. Bioorg Med Chem23:5390-401 (2015) 
 
Cannabinoid receptor 2
Name:Cannabinoid receptor 2
Type:G Protein-Coupled Receptor (GPCR)
Mol. Mass.:39690.94
Organism:Homo sapiens (Human)
Description:P34972
Residue:360
BDBM50111557
NameBDBM50111557
Synonyms:CHEMBL3605036
TypeSmall organic molecule
Emp. Form.C20H14Cl2O3
Mol. Mass.373.229
SMILESCc1cccc(c1)C(=O)c1cc(O)c(c(O)c1)-c1cc(Cl)cc(Cl)c1