Reaction Details
TargetCannabinoid receptor 1
LigandBDBM50111518
Substrate/Competitorn/a
Meas. Tech.ChEMBL_1510268 (CHEMBL3606864)
EC50>5000±n/a nM
Citation Presley, CSMustafa, SMAbidi, AHMoore, BM Synthesis and biological evaluation of (3',5'-dichloro-2,6-dihydroxy-biphenyl-4-yl)-aryl/alkyl-methanone selective CB2 inverse agonist. Bioorg Med Chem23:5390-401 (2015) 
 
Cannabinoid receptor 1
Name:Cannabinoid receptor 1
Type:G Protein-Coupled Receptor (GPCR)
Mol. Mass.:52868.96
Organism:Homo sapiens (Human)
Description:P21554
Residue:472
BDBM50111518
NameBDBM50111518
Synonyms:CHEMBL3605034
TypeSmall organic molecule
Emp. Form.C19H18Cl2O3
Mol. Mass.365.25
SMILESOc1cc(cc(O)c1-c1cc(Cl)cc(Cl)c1)C(=O)C1CCCCC1