Reaction Details
TargetCannabinoid receptor 1
LigandBDBM50111557
Substrate/Competitorn/a
Meas. Tech.ChEMBL_1510265 (CHEMBL3606861)
Ki>10000±n/a nM
Citation Presley, CSMustafa, SMAbidi, AHMoore, BM Synthesis and biological evaluation of (3',5'-dichloro-2,6-dihydroxy-biphenyl-4-yl)-aryl/alkyl-methanone selective CB2 inverse agonist. Bioorg Med Chem23:5390-401 (2015) 
 
Cannabinoid receptor 1
Name:Cannabinoid receptor 1
Type:G Protein-Coupled Receptor (GPCR)
Mol. Mass.:52868.96
Organism:Homo sapiens (Human)
Description:P21554
Residue:472
BDBM50111557
NameBDBM50111557
Synonyms:CHEMBL3605036
TypeSmall organic molecule
Emp. Form.C20H14Cl2O3
Mol. Mass.373.229
SMILESCc1cccc(c1)C(=O)c1cc(O)c(c(O)c1)-c1cc(Cl)cc(Cl)c1