Reaction Details
TargetCannabinoid receptor 1
LigandBDBM50111521
Substrate/Competitorn/a
Meas. Tech.ChEMBL_1510265 (CHEMBL3606861)
Ki 1138±n/a nM
Citation Presley, CSMustafa, SMAbidi, AHMoore, BM Synthesis and biological evaluation of (3',5'-dichloro-2,6-dihydroxy-biphenyl-4-yl)-aryl/alkyl-methanone selective CB2 inverse agonist. Bioorg Med Chem23:5390-401 (2015) 
 
Cannabinoid receptor 1
Name:Cannabinoid receptor 1
Type:G Protein-Coupled Receptor (GPCR)
Mol. Mass.:52868.96
Organism:Homo sapiens (Human)
Description:P21554
Residue:472
BDBM50111521
NameBDBM50111521
Synonyms:CHEMBL3605040
TypeSmall organic molecule
Emp. Form.C21H16Cl2O3
Mol. Mass.387.256
SMILESCCc1ccc(cc1)C(=O)c1cc(O)c(c(O)c1)-c1cc(Cl)cc(Cl)c1